"age","dzgroup","num.co","edu","income","scoma","totcst","race","meanbp","hrt","resp","temp","pafi"
62.85,"Lung Cancer",0,11,"$11-$25k",0,,"other",97,69,22,36,388
60.34,"Cirrhosis",2,12,"$11-$25k",44,,"white",43,112,34,34.59,98
52.75,"Cirrhosis",2,12,"under $11k",0,,"white",70,88,28,37.4,231.66
42.38,"Lung Cancer",2,11,"under $11k",0,,"white",75,88,32,35,
79.88,"ARF/MOSF w/Sepsis",1,,,26,,"white",59,112,20,37.9,173.31
93.02,"Coma",1,14,,55,,"white",110,101,44,38.4,266.63
62.37,"CHF",1,14,"$25-$50k",0,,"white",78,120,28,37.4,309.5
86.84,"CHF",3,,,26,,"white",72,100,26,37.59,404.75
85.66,"Lung Cancer",2,12,,26,,"black",97,56,20,36.59,357.13
42.26,"Colon Cancer",0,11,"$25-$50k",0,,"hispanic",84,94,20,38.2,
47.94,"CHF",1,12,,0,,"white",70,105,24,36.5,
59.2,"Lung Cancer",0,14,,0,,"white",77,90,22,36.4,
29,"Cirrhosis",1,16,"$11-$25k",0,,"white",56,56,20,37.2,
68.14,"CHF",0,12,"$11-$25k",0,,"white",68,80,22,36,
43.54,"ARF/MOSF w/Sepsis",1,,,26,390460.5,"white",67,172,20,38.8,113.33
58.82,"Lung Cancer",1,12,">$50k",0,,"white",97,92,20,37.2,
45.42,"Lung Cancer",2,,,0,,"white",97,100,24,37.3,585.13
63.66,"ARF/MOSF w/Sepsis",0,22,"$25-$50k",26,156674.13,"white",69,108,22,36.7,155.53
31.84,"Cirrhosis",2,16,"under $11k",0,17528.44,"white",83,100,24,37.4,
55.14,"CHF",1,8,"$11-$25k",0,,"hispanic",78,72,20,36,
68.25,"Lung Cancer",0,13,">$50k",0,,"white",91,92,20,36.5,
48.7,"Lung Cancer",0,16,,0,33002.5,"other",66,125,30,37,170
49.61,"ARF/MOSF w/Sepsis",1,12,"$25-$50k",0,288592.25,"white",67,120,48,38.9,200
50.72,"Lung Cancer",0,12,"$25-$50k",0,,"asian",71,88,24,37.4,
29.36,"Colon Cancer",0,17,"$25-$50k",0,,"white",96,112,20,37,
53.84,"COPD",1,,"under $11k",0,6112.46,"white",134,106,22,37.9,304.13
82.41,"Lung Cancer",0,,,44,,"white",75,114,20,37.2,
27.32,"MOSF w/Malig",1,19,,26,82131.25,"asian",77,144,36,38.9,45
30.11,"ARF/MOSF w/Sepsis",2,,,37,29342.39,"asian",92,112,27,37.59,225
50.37,"Cirrhosis",2,16,"$11-$25k",0,304749.25,"white",98,82,20,37.4,197.5
74.48,"CHF",2,16,">$50k",0,12751.73,"white",111,60,32,36.8,
55.73,"Cirrhosis",2,8,"under $11k",0,28262.7,"hispanic",121,118,18,37.4,404.75
77.21,"COPD",2,0,,0,6898.49,"hispanic",113,93,25,36.2,250
61.02,"ARF/MOSF w/Sepsis",1,,,37,57442.78,"white",80,128,30,38.5,217.5
56.49,"CHF",1,12,,0,20959.2,"hispanic",38,92,20,36,
57.53,"Cirrhosis",1,14,"under $11k",0,103090.44,"hispanic",77,92,18,37.59,552.38
68.99,"COPD",1,10,"under $11k",0,2965.95,"white",76,78,26,36.59,280.94
41.98,"CHF",1,14,"$11-$25k",0,3679.84,"white",120,86,22,37.5,295.19
19.79,"ARF/MOSF w/Sepsis",0,12,"under $11k",0,,"black",83,52,6,39,310
57.51,"CHF",0,14,"under $11k",0,3672.07,"black",83,106,24,36.8,280.94
73.41,"Colon Cancer",1,,,0,14292.27,"white",71,76,10,37,
68.32,"Colon Cancer",1,21,">$50k",0,5793.19,"white",89,92,18,39,
75.79,"ARF/MOSF w/Sepsis",1,,,0,136387.88,"white",59,90,22,37.5,70.91
45.72,"CHF",1,12,,0,61771.06,"white",57,96,22,36,185
75.49,"CHF",1,16,"under $11k",0,64202.38,"hispanic",62,102,24,36.59,415
75,"ARF/MOSF w/Sepsis",0,,,0,173763.5,"white",50,120,18,36.2,237.5
56.19,"ARF/MOSF w/Sepsis",0,6,,26,119196,"other",68,130,28,38.5,121.66
44.85,"MOSF w/Malig",2,10,"$11-$25k",0,12210.78,"hispanic",91,70,32,37.09,447.56
51.1,"CHF",1,11,,0,17287.95,"black",100,120,32,37.59,203.69
36.31,"CHF",2,16,,0,14620.8,"white",64,115,20,36.3,
76.26,"CHF",3,12,,0,8138.44,"white",74,96,30,36.4,266.63
51.3,"CHF",1,12,"under $11k",0,30876.38,"black",71,104,18,36.5,
74.54,"COPD",2,12,"under $11k",0,5835.16,"white",83,92,22,36.4,164
54.31,"Lung Cancer",1,17,"$25-$50k",0,17625.75,"white",95,108,22,38,183
77.58,"CHF",2,,,0,2022.1,"other",90,84,32,36.59,276.19
84.96,"CHF",4,14,">$50k",0,18401.72,"white",92,80,32,37.2,313.31
41.52,"MOSF w/Malig",2,18,">$50k",26,165178.88,"white",66,130,18,37.5,315
39.69,"ARF/MOSF w/Sepsis",0,22,"$25-$50k",0,109700.75,"white",62,125,24,39.2,208.56
72.56,"COPD",3,,,0,3078.6,"white",123,98,32,37.2,144.88
60.1,"Cirrhosis",1,,,0,32079.95,"white",110,125,10,38.09,208
70.81,"CHF",1,,,0,4126.07,"black",88,80,22,37,
30.76,"CHF",1,10,"under $11k",0,5632.85,"hispanic",70,122,16,36.5,528.5
64.24,"ARF/MOSF w/Sepsis",1,12,,0,162087.25,"white",68,122,12,38.7,114
51.71,"CHF",1,,,0,18348.22,"asian",50,75,20,36.8,
64.64,"ARF/MOSF w/Sepsis",3,12,,9,95272.69,"white",68,92,38,38.8,113.67
69.41,"Lung Cancer",2,16,"$25-$50k",26,5389.13,"white",109,68,20,36.9,
57.19,"CHF",2,12,"$11-$25k",0,17331.09,"white",59,85,26,36.8,204.75
37.73,"CHF",1,12,"$25-$50k",0,14961.09,"white",67,130,16,36.5,347.56
44.05,"Colon Cancer",0,16,">$50k",0,11069.47,"white",85,72,20,37.4,
72.16,"ARF/MOSF w/Sepsis",1,12,">$50k",26,95392.75,"white",75,120,24,38.3,257.5
45.57,"MOSF w/Malig",3,18,"$25-$50k",0,92664.63,"white",33,140,33,38.5,129
41.96,"Lung Cancer",1,16,">$50k",0,2648.1,"white",97,88,20,36.4,380.94
59.31,"ARF/MOSF w/Sepsis",0,15,">$50k",26,301788.5,"white",60,160,38,37.3,113.33
45.61,"Cirrhosis",3,16,">$50k",44,155929.75,"white",57,112,28,38.59,134.44
65.98,"Colon Cancer",1,12,,0,9559.23,"hispanic",127,96,26,38.9,372
95.79,"ARF/MOSF w/Sepsis",1,,,44,36613.28,"white",88,65,8,37.2,360
76.59,"Colon Cancer",1,17,"$11-$25k",0,4350.37,"white",83,76,18,38.3,390.44
68.1,"CHF",1,12,"$11-$25k",0,5151.05,"white",72,80,18,36.8,
78.85,"ARF/MOSF w/Sepsis",2,,,37,20195.58,"white",60,112,11,36.59,214.28
37.87,"ARF/MOSF w/Sepsis",1,,,9,207528.5,"white",83,122,26,37.59,257.5
74.91,"COPD",1,16,,0,4166.7,"white",106,84,22,37,424
31.7,"Cirrhosis",0,14,,0,101867.94,"black",77,80,20,37.2,490.44
54.94,"CHF",3,14,"$11-$25k",0,15429.62,"white",55,104,24,36.8,504
43.3,"Cirrhosis",3,14,"under $11k",0,108597.56,"hispanic",83,80,20,37,
54.93,"Lung Cancer",0,12,"$25-$50k",0,7098.3,"asian",143,84,40,36.2,
70.21,"Colon Cancer",1,12,"$11-$25k",0,5144.72,"white",117,22,18,38,
67.09,"Cirrhosis",2,3,"under $11k",0,37093.13,"black",104,82,20,37,
65.05,"Cirrhosis",2,14,"$25-$50k",0,9489.54,"white",77,72,22,36.4,
69.35,"MOSF w/Malig",2,18,,0,214329.25,"asian",112,125,14,36.5,274.25
64.99,"Lung Cancer",0,,,0,4735.99,"white",110,80,20,36.4,
80.62,"ARF/MOSF w/Sepsis",1,,,37,53111.31,"white",61,140,32,39.2,75.55
72.17,"Lung Cancer",1,,,0,31507.81,"white",63,140,36,36.5,176.66
53.06,"COPD",2,,"under $11k",0,3384.62,"white",77,72,24,36.4,280.94
52.51,"CHF",1,12,"$11-$25k",0,11022.1,"white",67,88,20,36.59,
74.97,"Colon Cancer",0,,,0,22430.06,"white",91,88,20,36.8,
53.35,"ARF/MOSF w/Sepsis",0,17,">$50k",26,285715.25,"asian",73,158,36,39.3,187.5
89.59,"ARF/MOSF w/Sepsis",2,,,100,9710.91,"white",33,0,0,38.5,122
56.62,"Colon Cancer",0,12,">$50k",0,15270.65,"white",116,102,18,38.4,
75.04,"Colon Cancer",0,16,,0,5835.23,"hispanic",123,112,28,36,352.38
75.76,"ARF/MOSF w/Sepsis",0,,,0,40581,"white",68,79,20,37.2,132.72
33,"Cirrhosis",2,19,"$25-$50k",9,46155.38,"other",62,130,8,36.59,296.63
72.4,"CHF",2,10,,0,6508.88,"black",115,104,20,37.3,460
66.5,"CHF",2,10,"under $11k",0,16443.36,"white",85,88,16,36.4,
72.78,"CHF",3,13,,0,26877.86,"white",65,105,26,39,132.5
61.57,"CHF",2,8,"under $11k",0,13137.51,"white",90,80,20,36,
52.43,"Colon Cancer",1,16,"$11-$25k",0,6753.28,"black",89,46,20,36.8,
66.93,"ARF/MOSF w/Sepsis",1,12,"under $11k",0,46006.16,"black",141,148,28,37.5,256.63
84.77,"COPD",1,16,"under $11k",0,9826.89,"white",70,75,50,36.5,200
80.17,"CHF",2,8,"$11-$25k",0,3811.31,"white",83,85,20,36,462.5
79.97,"CHF",2,14,"$11-$25k",0,10868.09,"other",69,62,20,36.5,352.38
66.46,"CHF",1,16,,0,14813.84,"white",85,70,20,36.4,
58.12,"ARF/MOSF w/Sepsis",2,12,"under $11k",0,16787.63,"white",66,130,30,37.7,81.33
67.49,"ARF/MOSF w/Sepsis",1,,,26,87621.75,"white",100,102,20,37.4,156
52.09,"Cirrhosis",3,8,"$11-$25k",0,8930.67,"white",89,92,20,37.4,442.81
66.59,"CHF",1,8,"$11-$25k",0,3679.96,"black",76,84,24,36.4,533.25
56.14,"Cirrhosis",1,,,0,3908.02,"white",109,80,20,36.59,
63.76,"Colon Cancer",2,,,0,5288.84,"white",104,78,22,36.59,
39.73,"CHF",1,12,"under $11k",0,9458.5,"black",69,112,22,37.2,
60.4,"CHF",2,16,">$50k",0,5027.72,"white",80,106,18,37,
57.77,"Colon Cancer",1,,,0,14744.8,"other",111,88,20,38,
48.07,"CHF",3,,,0,3670.07,"other",69,88,28,36.4,255
76.68,"ARF/MOSF w/Sepsis",1,12,,26,109920.38,"black",84,145,16,38.7,150
78.36,"CHF",2,12,,0,3081.27,"black",60,115,20,36,404.75
85.3,"ARF/MOSF w/Sepsis",1,,,0,10969.53,"white",62,64,36,36.9,142.84
62.47,"CHF",2,11,"$11-$25k",0,36036.97,"white",55,105,24,36.7,
76.41,"CHF",2,6,,0,2759.83,"black",113,80,20,36.3,
45.11,"Lung Cancer",1,,,9,7766.03,"black",109,98,18,36.4,
68.13,"Cirrhosis",2,,,0,4581.8,"black",80,80,16,37.2,485.69
82.18,"Lung Cancer",1,15,"$25-$50k",0,10364.78,"white",90,80,24,37.7,
41.87,"Cirrhosis",3,,">$50k",0,38119.47,"white",95,64,16,36.5,235
76.21,"Cirrhosis",2,11,"under $11k",9,2314.85,"black",103,90,20,37.7,
60.04,"ARF/MOSF w/Sepsis",1,12,"under $11k",37,272995.25,"white",67,82,26,37.4,228.88
77.14,"ARF/MOSF w/Sepsis",0,20,"$11-$25k",0,81082.19,"white",67,94,24,36.2,156.91
72.96,"ARF/MOSF w/Sepsis",0,13,"$11-$25k",0,22744.08,"white",56,69,20,38.5,110
59.41,"CHF",2,12,">$50k",0,11541.8,"white",57,114,28,36.5,
72.84,"ARF/MOSF w/Sepsis",1,,,26,357918.75,"white",67,95,18,38.8,140
50.23,"ARF/MOSF w/Sepsis",1,,,37,24166.03,"white",94,97,38,39.2,204.06
71.56,"Colon Cancer",1,12,"$25-$50k",0,8141.45,"white",137,80,20,38.5,
71.9,"Colon Cancer",1,10,,0,14901.66,"hispanic",106,88,20,36,
44.63,"ARF/MOSF w/Sepsis",1,,,9,20818.84,"white",78,122,16,38.7,204.44
51.98,"Colon Cancer",1,17,">$50k",0,16406.41,"white",95,64,18,37.5,300
53.83,"CHF",0,12,"$25-$50k",0,14452.73,"hispanic",63,96,18,35.9,
50.43,"MOSF w/Malig",3,,,26,35895.09,"white",54,136,32,36.9,175
31.69,"ARF/MOSF w/Sepsis",1,14,"$11-$25k",0,165149,"hispanic",140,50,28,38.9,167.5
65.31,"COPD",1,12,"under $11k",26,40449.31,"white",99,150,16,37.4,348.56
81.54,"CHF",3,12,"$25-$50k",0,13284.58,"white",84,61,20,37.2,359.25
66.4,"CHF",1,16,"under $11k",0,10426.79,"white",59,54,18,36.59,376.19
50.2,"ARF/MOSF w/Sepsis",1,,,0,100290,"white",60,145,27,37.7,122.5
88.3,"CHF",2,8,,0,39865.09,"white",72,80,26,37.2,180
58.41,"Colon Cancer",1,14,"$25-$50k",0,26872.97,"white",91,88,24,37,
56.35,"Lung Cancer",2,,,0,13389.57,"white",67,140,36,39,216.66
71.7,"Colon Cancer",0,19,,0,3470.76,"white",68,60,20,37,
32.14,"MOSF w/Malig",2,,,0,123820.94,"other",24,145,30,38.7,222.5
48.11,"Cirrhosis",2,2,"$11-$25k",0,31515.38,"hispanic",77,92,30,36.2,
76.38,"Colon Cancer",1,,,0,14783.82,"other",82,62,18,37,390.44
57.81,"ARF/MOSF w/Sepsis",2,12,"under $11k",26,58915.19,"white",113,82,16,37,267.5
66.77,"Colon Cancer",1,12,,0,9215.31,"white",79,87,19,36.5,
46.46,"Colon Cancer",1,16,">$50k",0,12927.03,"white",89,80,20,37.5,
64.35,"Colon Cancer",1,12,"$11-$25k",0,42579.81,"white",120,112,28,38.8,
75.24,"Colon Cancer",1,12,"$11-$25k",0,14225.7,"asian",103,90,20,37,628
74.6,"ARF/MOSF w/Sepsis",3,10,,0,31826.56,"white",157,40,16,36,220
36.46,"Coma",0,,,61,112886.88,"white",110,123,34,39,104
63.77,"ARF/MOSF w/Sepsis",1,16,">$50k",26,47001,"white",71,96,32,38,128.56
65.71,"Colon Cancer",1,18,"$25-$50k",0,4916.81,"hispanic",84,81,20,37.9,
20.83,"MOSF w/Malig",1,,,0,197040.13,"white",0,0,0,37.8,130
52.67,"Coma",0,,,94,52896.78,"white",88,72,12,36.2,277.5
75.37,"ARF/MOSF w/Sepsis",1,,,26,64887.81,"white",63,60,4,37.8,166
53.87,"CHF",2,18,,0,12116.03,"white",63,68,26,36,400
44.36,"CHF",3,12,"$11-$25k",0,6767.76,"white",69,136,20,36.4,261.88
53.62,"Cirrhosis",2,12,,0,180716.38,"white",76,88,18,37.2,
84.9,"Colon Cancer",2,15,"$11-$25k",0,5748.93,"white",86,80,20,36.3,
70.84,"CHF",3,,,0,6502.73,"white",68,61,39,37.09,383.63
70.06,"CHF",4,12,"under $11k",0,10228.86,"hispanic",111,80,16,35.9,304.75
37.72,"ARF/MOSF w/Sepsis",0,13,,26,132976.5,"white",61,140,45,39.09,238
65.46,"Lung Cancer",1,13,"$11-$25k",0,23832,"black",90,68,18,36.2,285.69
29.88,"ARF/MOSF w/Sepsis",1,16,">$50k",26,103008.56,"white",81,118,20,38,95
87.52,"ARF/MOSF w/Sepsis",1,,,0,232752.25,"white",127,120,34,37.8,75
18.15,"ARF/MOSF w/Sepsis",2,12,"$11-$25k",26,328378.5,"hispanic",44,142,27,37.2,314.25
42.92,"ARF/MOSF w/Sepsis",2,,,26,133680.88,"white",63,132,50,39.5,77.33
37.4,"Cirrhosis",3,13,"$11-$25k",0,86323.88,"black",73,120,24,37.09,233.31
63.47,"Colon Cancer",1,,,0,16300.98,"white",124,118,20,37.4,313.31
53.58,"COPD",1,,,0,2881.54,"white",93,92,12,36.59,256
70.07,"CHF",1,11,"$11-$25k",0,18993.53,"black",80,90,18,36.8,
47.63,"ARF/MOSF w/Sepsis",1,,,0,71315.31,"asian",25,125,10,36,167.34
51.55,"ARF/MOSF w/Sepsis",1,10,,0,79871.5,"white",65,126,29,37.9,165
90.84,"CHF",1,12,,0,8867.67,"white",100,82,22,36.2,210
35.63,"ARF/MOSF w/Sepsis",0,,,0,12434.37,"black",25,150,28,37.2,309.5
63.86,"Coma",0,,,94,25078.2,"white",139,122,10,38.7,350
67.04,"ARF/MOSF w/Sepsis",1,10,"$11-$25k",9,55332.78,"white",129,125,36,38,272.5
61.16,"ARF/MOSF w/Sepsis",2,12,,9,39.5,"white",66,105,20,36.5,274
77.13,"Lung Cancer",3,,,0,5321.59,"white",62,82,12,36.4,276.19
19.14,"CHF",1,12,"$25-$50k",0,134573.25,"white",61,108,26,36.5,
64.18,"Colon Cancer",2,14,"$11-$25k",0,13976.27,"white",100,120,18,37.5,
53.3,"Colon Cancer",1,,,0,8599.2,"white",89,120,20,39.7,
55.29,"CHF",2,13,,0,11965.48,"white",59,145,20,37,456.63
53.15,"CHF",2,14,,0,9827.42,"asian",75,72,18,36.09,
32.44,"ARF/MOSF w/Sepsis",1,11,,37,633212,"white",51,96,30,37.4,108.56
58.96,"ARF/MOSF w/Sepsis",0,13,"$25-$50k",9,121042.44,"white",115,132,20,39.8,326.63
27.41,"ARF/MOSF w/Sepsis",1,,,26,63008.56,"white",78,130,8,38.5,228
77.09,"CHF",2,16,">$50k",9,13112.53,"white",93,86,22,36.59,
63.69,"CHF",3,11,"$11-$25k",0,24669.16,"white",52,122,32,39.09,
62.19,"Lung Cancer",1,,,0,23257.59,"black",86,60,18,37.2,
53.52,"COPD",3,12,"$11-$25k",9,12010.26,"white",92,112,36,37.5,174.97
23.4,"ARF/MOSF w/Sepsis",2,11,"$11-$25k",26,473212.25,"hispanic",87,144,45,37.3,335
65.61,"CHF",3,12,,0,13346.12,"white",94,140,24,35.8,390.44
70.28,"Cirrhosis",2,,,0,15654.16,"white",106,74,20,37,
60.72,"ARF/MOSF w/Sepsis",2,,,0,32674.75,"white",47,80,14,35.8,135
77,"CHF",2,,,0,10120.93,"white",99,80,24,36.5,
42.05,"CHF",1,12,"$11-$25k",0,14291.54,"hispanic",62,120,24,36.8,
60.75,"ARF/MOSF w/Sepsis",1,,,0,144957.75,"asian",63,150,32,38.7,89
71.29,"CHF",1,15,,0,3407.76,"white",63,82,12,36.2,
22.67,"CHF",1,15,,0,10188.01,"hispanic",35,115,40,36.4,175.5
59.12,"ARF/MOSF w/Sepsis",3,11,"$11-$25k",0,22028.34,"white",57,156,14,37.5,170
63.9,"Cirrhosis",2,12,">$50k",0,139701.25,"hispanic",72,105,18,38.4,338.06
87.43,"CHF",2,,,0,43052.13,"white",75,135,8,37.8,138
78.9,"COPD",1,12,,0,22146.5,"white",94,75,26,36.5,326.06
83.64,"CHF",1,10,,9,14852.4,"white",63,62,28,39.4,214.28
47.74,"ARF/MOSF w/Sepsis",0,12,,0,298585.25,"black",47,164,31,39.3,52
78.85,"CHF",3,8,,0,6578.91,"black",114,78,20,37.8,328.56
51.18,"CHF",3,6,"under $11k",0,13689.93,"black",88,80,18,36.7,
61.45,"Colon Cancer",1,30,">$50k",0,33484.44,"white",102,90,20,37,
55.2,"CHF",4,15,"under $11k",0,2104.11,"other",93,74,24,36,
74.06,"ARF/MOSF w/Sepsis",1,,,0,25857.06,"white",115,95,12,37.5,113.84
90.91,"ARF/MOSF w/Sepsis",0,,,0,35313.44,"white",133,115,9,38.5,372.5
38.95,"Cirrhosis",1,9,"$11-$25k",0,68405.44,"hispanic",64,102,18,36.4,
65.15,"Lung Cancer",1,,,0,3330.9,"white",83,106,22,36.4,
51.63,"CHF",3,13,"$25-$50k",0,13344.62,"white",65,88,16,36.3,
56.2,"Lung Cancer",2,,,0,27174.36,"white",107,92,20,37.2,304.75
65.89,"ARF/MOSF w/Sepsis",0,,,26,10503.04,"white",61,60,30,37,217.13
69.2,"CHF",2,14,"$11-$25k",0,14226.47,"asian",47,70,20,36.8,565
77.75,"Lung Cancer",1,,,0,7677.8,"other",89,80,18,36.9,
80.1,"CHF",2,12,"$11-$25k",0,3081.89,"white",93,80,20,36.8,
71.55,"Lung Cancer",1,20,">$50k",0,12482.88,"white",120,89,26,36.9,257.13
60.62,"CHF",1,14,,0,26983.67,"white",50,110,20,36.8,
58.48,"CHF",4,,,0,1780.99,"white",106,88,36,36.4,
52.68,"CHF",2,16,,0,10086.72,"asian",60,150,16,36.8,
70.49,"ARF/MOSF w/Sepsis",1,,,0,76851.75,"white",62,80,15,38.5,146
50.58,"Cirrhosis",1,10,"$25-$50k",0,5367.98,"hispanic",70,82,20,36.8,385.69
25.49,"ARF/MOSF w/Sepsis",1,,,0,61916.22,"white",123,100,48,38.5,191.81
88.69,"Coma",2,,">$50k",89,14263.62,"white",102,123,14,38.4,397.13
68.02,"MOSF w/Malig",1,,,26,324373.75,"white",70,115,10,37.5,218
81.78,"Cirrhosis",2,7,,0,3686.43,"black",107,92,26,36.8,
71.86,"CHF",3,12,"under $11k",0,2602.37,"white",87,80,20,36.09,342.81
72.2,"CHF",3,,,9,6090.79,"black",107,72,18,36.8,
53.41,"ARF/MOSF w/Sepsis",0,14,,26,52412.25,"white",113,120,25,37.3,260
34.36,"ARF/MOSF w/Sepsis",2,10,,26,55677.63,"hispanic",48,120,33,38.5,150
56.66,"ARF/MOSF w/Sepsis",0,,,0,102511.38,"white",63,125,30,38.5,148
53.68,"Cirrhosis",3,13,,0,8907.63,"white",113,100,24,37,
55.33,"Lung Cancer",2,12,"$25-$50k",0,7751.68,"asian",93,112,20,37.2,
54.06,"Coma",2,18,"$25-$50k",55,22832.27,"white",110,165,34,39.2,223.31
70.8,"ARF/MOSF w/Sepsis",2,10,"$11-$25k",37,110654.81,"hispanic",83,135,34,39,296.25
86.57,"Coma",1,,,94,5654.99,"white",97,80,28,36.8,24
52.45,"Lung Cancer",2,,,0,6520.2,"white",84,80,20,36.2,
50.98,"COPD",2,14,"under $11k",0,12740.81,"white",122,110,32,36.5,124.48
77.76,"CHF",2,14,,0,18083.3,"white",58,60,16,36.2,
54.18,"MOSF w/Malig",1,17,">$50k",9,20159.03,"white",60,190,40,39.5,90
34.17,"ARF/MOSF w/Sepsis",1,13,"under $11k",26,,"white",67,85,34,33.9,46
80.52,"CHF",3,,,0,3727.52,"white",97,88,20,36.8,319
50.53,"CHF",2,13,,0,11205.4,,66,80,24,36.7,
56.82,"COPD",3,,,0,23862.58,"black",70,60,19,37,165.69
45.89,"ARF/MOSF w/Sepsis",0,,,9,,"black",115,145,32,38.7,510
69.72,"Coma",2,,,100,11611.6,"white",115,95,16,36.4,236.66
65.9,"ARF/MOSF w/Sepsis",0,11,"$11-$25k",26,,"white",130,110,26,38.2,365
38.49,"ARF/MOSF w/Sepsis",1,,,0,56904.38,"white",123,125,38,39.8,162
65.54,"MOSF w/Malig",1,27,">$50k",0,30566.94,"black",108,100,12,39.3,220
59.15,"Lung Cancer",2,11,,0,9855.55,"white",74,128,24,38.9,
53.92,"Colon Cancer",1,16,"$25-$50k",0,28130.03,"white",83,100,24,37.4,
40.63,"CHF",1,1,"$11-$25k",0,16497.94,"hispanic",95,94,26,36,
65.68,"Lung Cancer",1,,,0,33842.34,"white",64,134,32,38.8,309.5
53.1,"CHF",3,,,0,7895.84,"white",43,150,22,36.7,610
43.28,"MOSF w/Malig",1,,,100,,,87,140,44,38.5,259.13
35.14,"Lung Cancer",0,14,">$50k",0,4021.03,"white",77,80,18,35.4,
51.5,"Cirrhosis",3,12,"under $11k",0,3633.07,"white",87,88,20,36.59,366.63
76.45,"ARF/MOSF w/Sepsis",1,11,,26,49963.5,"white",108,140,20,39,
81.25,"Coma",1,,,100,7722.8,"white",58,70,30,37.5,178
19.61,"ARF/MOSF w/Sepsis",0,,,0,,"white",48,131,12,38.8,156.25
63.43,"ARF/MOSF w/Sepsis",0,16,"$11-$25k",26,,"white",90,130,20,37.09,230
52.37,"COPD",3,12,"under $11k",0,3758.24,"black",102,80,18,37,300
38.88,"ARF/MOSF w/Sepsis",0,16,,37,18825.92,"hispanic",83,110,30,38.7,257.13
77.68,"MOSF w/Malig",1,,,41,13928.52,"white",38,110,20,38.8,207.69
75.97,"Lung Cancer",2,12,"under $11k",9,7979.45,"white",107,100,20,36.4,
42.39,"MOSF w/Malig",1,,,0,108952.44,"white",112,70,18,36.59,144
47.25,"Lung Cancer",1,16,,0,15755.88,"asian",47,140,32,38.59,246.94
69.67,"Cirrhosis",1,,,0,62152.91,"white",93,150,14,37,142.84
57.58,"CHF",3,10,"under $11k",0,15292.6,"white",65,125,26,36.9,400
50.65,"CHF",2,12,"under $11k",0,13861.81,"black",67,115,30,36.8,419
60.08,"Colon Cancer",1,12,">$50k",0,13441.86,"white",103,110,18,36.8,283.31
67.48,"Colon Cancer",1,,,0,7928.35,"white",108,58,20,38.9,
62.88,"Colon Cancer",1,14,">$50k",0,14252.59,"white",96,120,24,39,
74.11,"COPD",2,12,"$11-$25k",44,34402.09,"white",63,160,12,37,134
66.73,"Colon Cancer",2,16,"$25-$50k",0,18453.28,"white",110,90,28,37.2,
71.4,"ARF/MOSF w/Sepsis",2,16,"$25-$50k",0,85802.94,"white",120,65,22,36.59,86.66
60.86,"Lung Cancer",0,,,0,13990.09,"white",98,110,20,37.5,196
47.38,"MOSF w/Malig",1,12,"$11-$25k",26,128401.81,"white",78,130,25,39.7,152
71.15,"CHF",5,10,"$11-$25k",0,15741.98,"black",127,110,24,37.5,455.5
64.25,"ARF/MOSF w/Sepsis",1,,"under $11k",0,17095.11,"hispanic",77,110,22,38,346.63
21.64,"Colon Cancer",1,16,">$50k",0,11209.37,"white",88,74,20,36.4,
60.59,"Lung Cancer",2,12,">$50k",9,10208.03,"white",117,135,26,36.5,
55.21,"COPD",1,,,0,15057.57,"black",93,95,26,37.3,223.31
66.55,"ARF/MOSF w/Sepsis",0,15,">$50k",0,177669.88,"white",67,150,20,39.4,182.5
66.67,"ARF/MOSF w/Sepsis",0,,,0,,"asian",112,150,19,40.2,177.5
73.37,"ARF/MOSF w/Sepsis",1,,,41,268835.5,"white",65,140,14,36.5,164
37.59,"ARF/MOSF w/Sepsis",1,,,0,15255.37,,103,120,28,36.5,380
61.34,"Colon Cancer",2,11,,9,16560.69,"hispanic",140,70,26,37.5,380
65.92,"Colon Cancer",2,16,">$50k",0,3760.68,"asian",73,82,16,37.8,
47.33,"COPD",2,,,0,15546.7,"white",73,140,36,36.2,185.69
32.18,"CHF",2,,,0,7960.19,"white",82,80,28,36,242.84
48.04,"ARF/MOSF w/Sepsis",1,18,,26,421848.5,"white",107,150,30,37.8,138
71.66,"Coma",0,,,55,,"white",113,110,20,39.9,215.53
64.45,"CHF",3,,,0,16595.14,"white",45,135,36,37.4,108.16
24.52,"ARF/MOSF w/Sepsis",1,10,,0,45348.78,"hispanic",120,110,28,37.5,69
74.03,"Colon Cancer",1,,,9,4587.72,"white",73,104,24,36.2,
72.03,"ARF/MOSF w/Sepsis",1,,,94,30964.69,"white",117,120,12,37.59,60
68.61,"CHF",2,,,0,5529.6,"white",87,80,24,36.5,332
59.41,"CHF",2,14,"$11-$25k",0,111605.25,"asian",78,80,24,37,
20.31,"ARF/MOSF w/Sepsis",0,13,,0,51038.16,"white",117,160,26,40.09,130
80.19,"ARF/MOSF w/Sepsis",0,,,61,15619.8,"white",98,90,32,38.5,355.5
42.07,"MOSF w/Malig",1,18,"$11-$25k",0,71544.75,"white",47,175,36,39.3,244.88
23.82,"MOSF w/Malig",1,13,"$25-$50k",0,129712.88,"black",127,140,28,37.9,53.33
65.97,"CHF",3,,,0,9118.72,"white",52,80,32,36.4,247.59
67,"CHF",1,12,,0,8664.97,"white",42,85,20,36.9,
58.1,"ARF/MOSF w/Sepsis",1,15,"$25-$50k",0,80889.19,"hispanic",57,120,10,38.3,192
35,"Coma",0,18,">$50k",44,36901.78,"white",103,115,20,37.4,330
65.96,"ARF/MOSF w/Sepsis",0,4,,0,100455.63,"hispanic",80,120,30,39,340
43.86,"Cirrhosis",1,12,"$11-$25k",0,104734,"hispanic",46,80,20,37.2,300
29.77,"ARF/MOSF w/Sepsis",0,,,0,97215.56,"asian",110,120,30,37.7,397.5
52.72,"Cirrhosis",3,20,"$11-$25k",26,24780.8,"white",97,75,18,36.4,290.44
26.25,"MOSF w/Malig",1,,,100,118488.25,"white",35,40,52,36.7,206
66.75,"ARF/MOSF w/Sepsis",1,,,0,165393.38,"white",67,120,22,37,106.66
53.13,"Lung Cancer",1,8,"$11-$25k",0,7457.16,"white",70,72,18,36.8,376.19
70.74,"ARF/MOSF w/Sepsis",1,17,">$50k",0,38194.5,"white",77,115,28,39,120.41
54.68,"CHF",2,14,,0,22746.25,"white",58,65,18,36.09,
81.45,"ARF/MOSF w/Sepsis",1,,,0,46889.41,"white",60,75,40,38.9,391
58.27,"COPD",1,,,0,74216.13,"black",77,115,12,37.3,68
36.97,"ARF/MOSF w/Sepsis",1,,,9,46872.94,"other",111,120,70,39.9,
44.48,"Cirrhosis",1,16,"$25-$50k",0,8186.14,"white",100,82,18,36.8,
79.98,"Colon Cancer",1,16,">$50k",0,27452.66,"white",115,70,22,38.4,
82.25,"Coma",0,,,61,39791,"white",123,75,9,36.7,295
38.5,"ARF/MOSF w/Sepsis",1,17,">$50k",26,269057,"white",73,130,18,38.59,237.5
59.38,"MOSF w/Malig",2,12,"under $11k",0,33652.5,"black",70,120,32,37,396.63
58.45,"CHF",2,20,"under $11k",0,18298.88,"white",85,90,28,37,403.31
83.3,"ARF/MOSF w/Sepsis",3,16,"under $11k",37,23976.92,"white",130,80,10,38.5,242.84
44,"Cirrhosis",3,12,"$11-$25k",26,173060.63,"white",80,130,20,36.3,485
50.1,"MOSF w/Malig",1,12,,0,16369.58,"other",97,80,16,37.4,419
80.19,"ARF/MOSF w/Sepsis",1,19,">$50k",0,125511.5,"white",133,120,36,38.7,204.44
40.2,"ARF/MOSF w/Sepsis",1,,,44,74438.94,"white",52,150,35,36.8,122
57.02,"CHF",2,,,0,7491.3,"white",93,88,18,37.2,423.75
38.91,"ARF/MOSF w/Sepsis",2,13,,0,23679.8,"white",107,120,28,37.5,280
75.54,"Colon Cancer",1,14,"$25-$50k",0,11379.58,"white",93,84,20,36.2,
34.81,"MOSF w/Malig",1,,,26,32862.09,"white",62,135,60,38.5,82
73.73,"Colon Cancer",1,,,0,24937.78,"white",127,88,18,36.8,
42.54,"MOSF w/Malig",1,,,26,106592.31,"white",50,140,30,38.5,396.63
68.7,"Lung Cancer",1,,,0,4938.37,"white",121,74,8,37.8,
73.56,"ARF/MOSF w/Sepsis",1,,,26,104663.5,"white",133,140,39,38.9,61
69.1,"Colon Cancer",1,,,0,21387.8,"white",97,115,28,37.3,
67.41,"Coma",1,,,100,10152.12,"white",35,140,10,41,171.41
79.72,"CHF",1,18,">$50k",0,12108.27,"asian",33,100,16,36.2,
48.36,"ARF/MOSF w/Sepsis",1,14,">$50k",0,31216.84,"hispanic",87,125,17,36.59,90.66
60.67,"CHF",2,12,">$50k",0,247740.75,"white",77,100,36,36.59,127.5
58.32,"Cirrhosis",2,,,0,3397.67,"hispanic",87,80,20,37.2,
59.88,"CHF",1,14,"$25-$50k",0,15499.78,"white",67,110,18,36.8,
64.03,"CHF",1,12,,0,6952.02,"white",62,70,18,36.5,252.38
34.46,"MOSF w/Malig",1,,,0,93435.31,"white",33,130,35,35.9,80