[Rd] make fails for 1.7.0 on mac os x 10.1

Roger Koenker roger@ysidro.econ.uiuc.edu
Thu Feb 6 14:31:02 2003

I've been running a binary installation (kindly provided by Jan de Leeuw)
on mac G4, but was inspired this morning to try to install 1.7.0 on the G4
as well as on my desktop solaris box.

This worked smoothly on my solaris system but on the G4 the
make dies shortly after compiling lapack with:

/usr/bin/libtool: internal link edit command failed
make[4]: *** [libRlapack.dylib] Error 1
make[3]: *** [R] Error 2
make[2]: *** [R] Error 1
make[1]: *** [R] Error 1
make: *** [R] Error 1

The output from configure seemed ok...but there were lots of messages of the following
sort that I thought might also suggest that something was wrong.

/usr/include/gcc/darwin/2.95.2/g++/../machine/limits.h:7: #error architecture not supported
In file included from /usr/include/sys/signal.h:70,
                 from /usr/include/signal.h:62,
                 from ../../../src/include/Defn.h:60,
                 from sockconn.c:32:
/usr/include/machine/signal.h:31: #error architecture not supported
In file included from /usr/include/setjmp.h:25,
                 from ../../../src/include/Defn.h:61,
                 from sockconn.c:32:

Any suggestions, greatly appreciated.

url:	www.econ.uiuc.edu	Roger Koenker		Dept. of Economics UCL,
email	rkoenker@uiuc.edu	Department of Economics Drayton House,
vox: 	217-333-4558		University of Illinois	30 Gorden St,
fax:   	217-244-6678		Champaign, IL 61820	London,WC1H 0AX, UK
							vox:	020-7679-5838