[Rd] trouble building r-devel

Seth Falcon sfalcon at fhcrc.org
Tue Mar 22 05:32:05 CET 2005

<Mark.Bravington at csiro.au> writes:
> cp unicode/iconv.dll ../../modules/
> cp: cannot stat `unicode/iconv.dll': No such file or directory
> make[2]: *** [rmodules] Error 1
> make[1]: *** [rbuild] Error 2
> make: *** [all] Error 2

See the section Unicode support here:

Basically, you just need to download and then copy the iconv.dll to
the right spot and you should be on your way.

+ seth

More information about the R-devel mailing list