[Rd] Build error with last R-devel tarball

hpages at fhcrc.org hpages at fhcrc.org
Tue Feb 6 00:46:22 CET 2007


On Windows, with last R-devel tarball (r40647) from
I get the following build error:

E:\biocbld\bbs-2.0-bioc\R\src\gnuwin32> make
---------- Making package utils ------------
  adding build stamp to DESCRIPTION
  installing NAMESPACE file and metadata
  installing R files
Error in namespaceExport(ns, exports) : undefined exports :?, CRAN.packages,
Rprof, Rprofmem, RShowDo
c, RSiteSearch, URLdecode, URLencode, alarm, apropos, argsAnywhere,
assignInNamespace, as.roman, as.p
erson, as.personList, available.packages, browseEnv, browseURL, bug.report,
capture.output, checkCRAN
, chooseCRANmirror, citation, citEntry, citHeader, citFooter, close.socket,
combn, compareVersion, co
ntrib.url, count.fields, data, data.entry, dataentry, de, de.ncols, de.restore,
de.setup, debugger, d
emo, download.file, download.packages, dump.frames, edit, emacs, example,
file_test, file.edit, find,
 fix, fixInNamespace, flush.console, formatOL, formatUL, getAnywhere,
getFromNamespace, getS3method,
glob2rx, head, head.matrix, help, help.search, help.start, history,
index.search, install.packages, i
nstalled.packages, limitedLabels, loadhistory, localeToCharset, ls.str, lsf.str,
make.socket, memory.limit, memory.size, menu, methods, mirror2html, modifyList,
In addition: Warning message:
S3 methods '[.getAnywhere', '[.roman', 'as.character.person',
'as.character.personList', 'as.characte
r.roman', 'as.person.default', 'as.personList.default', 'as.personList.person',
'edit.data.frame', 'e
dit.default', 'edit.matrix', 'edit.vignette', 'format.roman', 'head.data.frame',
'head.default', 'hea
d.function', 'head.matrix', 'head.ftable', 'head.table', 'print.citation',
'print.Bibtex', 'print.cit
ationList', 'print.getAnywhere', 'print.hsearch', 'print.help_files_with_topic',
'print.Latex', 'prin
t.ls_str', 'print.MethodsFunction', 'print.packageDescription',
'print.packageIQR', 'print.packageSta
tus', 'print.roman', 'print.sessionInfo', 'print.socket', 'print.vignette',
'prompt.data.frame', 'pro
mpt.default', 'stack.data.frame', 'stack.default', 'str.POSIXt',
'str.data.frame', 'str.default', 'su
mmary.packageStatus', 'tail.data.frame', 'tail.default', 'tail.function',
'tail.matrix', 'tail.ftable
', 'tail.table', 'toBibtex.citation', 'toBibtex.citationList',
'toBibtex.person', 'toBibtex [... trun
Execution halted
make[4]: *** [E:/biocbld/bbs-2.0-bioc/R/library/utils/R/utils] Error 1
make[3]: *** [all] Error 2
make[2]: *** [pkg-utils] Error 2
make[1]: *** [rpackage] Error 1
make: *** [all] Error 2


More information about the R-devel mailing list