[Rd] Build failing on win64

Jeroen Ooms jeroen @end|ng |rom berke|ey@edu
Fri May 22 10:18:47 CEST 2020

As of commit 78536 earlier this morning the build is failing on
windows 64, see https://r-devel.github.io

I cannot immediately spot what is the problem. The build fails with:

installing 'sysdata.rda'
  make[3]: *** [../../../share/make/basepkg.mk:151: sysdata] Error 127
  make[2]: *** [Makefile.win:22: all] Error 2
  make[1]: *** [Makefile.win:32: R] Error 1

More information about the R-devel mailing list