[Rd] R-devel_2015-09-14 throws an error in reg-packages test

Jeroen Ooms jeroen.ooms at stat.ucla.edu
Wed Sep 16 22:56:19 CEST 2015

On Wed, Sep 16, 2015 at 9:32 PM, Avraham Adler <avraham.adler at gmail.com> wrote:

> When running make check, I get the following error:
> running code in 'reg-packages.R' ...make[3]: *** [reg-packages.Rout] Error 1
> make[2]: *** [test-Reg] Error 2
> make[1]: *** [test-all-basics] Error 1
> make: *** [check] Error 2
> Looking at reg-packages.Rout.fail shows

The r-devel commit log [1] shows that Martin has been working on this
test over the past few days. Sometimes work-in-progress causes the
daily svn snapshot to be broken; typically it gets fixed the next day
or so. If you don't want to wait, try building
R-devel_2015-09-10.tar.gz that one works.

[1] https://github.com/wch/r-source/commits/trunk

More information about the R-devel mailing list